{"text_format":"1","workbook":"xlsx","n_sheets":8,"sheets":["Dashboard","Feuil1","Budget","Réel","Transactions","Transfert","Contrôle","Traitement"],"not_rendered":{"charts":11,"images":1,"macros":1,"external_links":0,"defined_names":12,"comments":2,"pivot_tables":0},"unopened":[],"bounds":{"document_bytes":16777216,"sheet_cells":100000,"rows_first":2000,"rows_last":500,"rows_between":2000,"halvings":0,"cell_chars":16384,"cell_head_chars":4096},"cells_cut":0,"cells_raw":0,"read":"whole","date_system":"1900"}

{"sheet":"Dashboard","index":0,"n_rows":42,"n_cols":24,"rows_kept":42,"cut":false,"hidden":false,"merged":[[7,1,8,3]]}
[]
[]
[]
[]
[]
[]
[]
[null,"Août"]
[]
[]
[]
[]
[]
[]
[]
[]
[]
[]
[]
[]
{"$rows_left_out":23}
{"sheet":"Feuil1","index":1,"n_rows":4,"n_cols":5,"rows_kept":4,"cut":false,"hidden":false,"merged":[]}
[]
[]
[null,null,"Car 1","Car 2","Ecart"]
[null,null,{"$f":"20000+2000*20","v":60000},{"$f":"20000+1500*20","v":50000},{"$f":"C4-D4","v":10000}]

{"sheet":"Budget","index":2,"n_rows":62,"n_cols":15,"rows_kept":62,"cut":false,"hidden":false,"merged":[]}
[]
[]
[]
[]
[null,null,{"$f":"C10-C25-C38-C46-C54-C62","v":0},0,0,0,0,0,0,28000,3000,18000,18000,180500,247500]
[null,"Revenus","Janvier","Février","Mars","Avril","Mai","Juin","Juillet","Août","Septembre","Octobre","Novembre","Décembre","Total"]
[null,"Salaire",null,null,null,null,null,null,null,650000,650000,650000,650000,650000,{"$f":"SUM(Revenus_budget[[#This Row],[Janvier]:[Décembre]])","v":3250000}]
[null,"Revenus complémentaires",null,null,null,null,null,null,null,null,null,null,null,487500,{"$f":"SUM(Revenus_budget[[#This Row],[Janvier]:[Décembre]])","v":487500}]
[null,"Autres revenus",null,null,null,null,null,null,null,30000,null,null,null,null,{"$f":"SUM(Revenus_budget[[#This Row],[Janvier]:[Décembre]])","v":30000}]
[null,"Total",{"$f":"SUBTOTAL(109,C7:C9)","v":0},{"$f":"SUBTOTAL(109,D7:D9)","v":0},0,0,0,0,0,680000,650000,650000,650000,1137500,{"$f":"SUM(Revenus_budget[[#This Row],[Janvier]:[Décembre]])","v":3767500}]
[]
[]
[]
[null,"Charges","Janvier","Février","Mars","Avril","Mai","Juin","Juillet","Août","Septembre","Octobre","Novembre","Décembre","Total"]
[null,"Loyer",null,null,null,null,null,null,null,65000,65000,65000,65000,65000,{"$f":"SUM(Dépenses_budget[[#This Row],[Janvier]:[Décembre]])","v":325000}]
[null,"CIE",null,null,null,null,null,null,null,5000,10000,10000,10000,10000,{"$f":"SUM(Dépenses_budget[[#This Row],[Janvier]:[Décembre]])","v":45000}]
[null,"SODECI",null,null,null,null,null,null,null,null,null,null,null,null,{"$f":"SUM(Dépenses_budget[[#This Row],[Janvier]:[Décembre]])","v":0}]
[null,"Gaz",null,null,null,null,null,null,null,null,null,null,null,null,{"$f":"SUM(Dépenses_budget[[#This Row],[Janvier]:[Décembre]])","v":0}]
[null,"Nourriture",null,null,null,null,null,null,null,50000,50000,50000,50000,50000,{"$f":"SUM(Dépenses_budget[[#This Row],[Janvier]:[Décembre]])","v":250000}]
[null,"Transport",null,null,null,null,null,null,null,55000,55000,55000,55000,55000,{"$f":"SUM(Dépenses_budget[[#This Row],[Janvier]:[Décembre]])","v":275000}]
{"$rows_left_out":43}
{"sheet":"Réel","index":3,"n_rows":65,"n_cols":15,"rows_kept":65,"cut":false,"hidden":false,"merged":[]}
[]
[]
[]
[]
[null,null,{"$f":"C10-C26-C41-C49-C57-C65","v":0},{"$f":"D10-D26-D41-D49-D57-D65","v":0},0,0,0,0,0,416813,0,0,0,0,416813]
[null,"Revenus","Janvier","Février","Mars","Avril","Mai","Juin","Juillet","Août","Septembre","Octobre","Novembre","Décembre","Total"]
[null,"Salaire",{"$f":"SUMPRODUCT((Transactions[Catégorie]=Revenus_budget10[[#This Row],[Revenus]])*(MONTH(Transactions[Date])=MONTH(DATEVALUE(\"1\"&C$6&\"2000\")))*(Transactions[Montant]))","v":0},{"$f":"SUMPRODUCT((Transactions[Catégorie]=Revenus_budget10[[#This Row],[Revenus]])*(MONTH(Transactions[Date])=MONTH(DATEVALUE(\"1\"&D$6&\"2000\")))*(Transactions[Montant]))","v":0},{"$f":"SUMPRODUCT((Transactions[Catégorie]=Revenus_budget10[[#This Row],[Revenus]])*(MONTH(Transactions[Date])=MONTH(DATEVALUE(\"1\"&E$6&\"2000\")))*(Transactions[Montant]))","v":0},{"$f":"SUMPRODUCT((Transactions[Catégorie]=Revenus_budget10[[#This Row],[Revenus]])*(MONTH(Transactions[Date])=MONTH(DATEVALUE(\"1\"&F$6&\"2000\")))*(Transactions[Montant]))","v":0},{"$f":"SUMPRODUCT((Transactions[Catégorie]=Revenus_budget10[[#This Row],[Revenus]])*(MONTH(Transactions[Date])=MONTH(DATEVALUE(\"1\"&G$6&\"2000\")))*(Transactions[Montant]))","v":0},{"$f":"SUMPRODUCT((Transactions[Catégorie]=Revenus_budget10[[#This Row],[Revenus]])*(MONTH(Transactions[Date])=MONTH(DATEVALUE(\"1\"&H$6&\"2000\")))*(Transactions[Montant]))","v":0},{"$f":"SUMPRODUCT((Transactions[Catégorie]=Revenus_budget10[[#This Row],[Revenus]])*(MONTH(Transactions[Date])=MONTH(DATEVALUE(\"1\"&I$6&\"2000\")))*(Transactions[Montant]))","v":0},{"$f":"SUMPRODUCT((Transactions[Catégorie]=Revenus_budget10[[#This Row],[Revenus]])*(MONTH(Transactions[Date])=MONTH(DATEVALUE(\"1\"&J$6&\"2000\")))*(Transactions[Montant]))","v":673885},{"$f":"SUMPRODUCT((Transactions[Catégorie]=Revenus_budget10[[#This Row],[Revenus]])*(MONTH(Transactions[Date])=MONTH(DATEVALUE(\"1\"&K$6&\"2000\")))*(Transactions[Montant]))","v":0},{"$f":"SUMPRODUCT((Transactions[Catégorie]=Revenus_budget10[[#This Row],[Revenus]])*(MONTH(Transactions[Date])=MONTH(DATEVALUE(\"1\"&L$6&\"2000\")))*(Transactions[Montant]))","v":0},{"$f":"SUMPRODUCT((Transactions[Catégorie]=Revenus_budget10[[#This Row],[Revenus]])*(MONTH(Transactions[Date])=MONTH(DATEVALUE(\"1\"&M$6&\"2000\")))*(Transactions[Montant]))","v":0},{"$f":"SUMPRODUCT((Transactions[Catégorie]=Revenus_budget10[[#This Row],[Revenus]])*(MONTH(Transactions[Date])=MONTH(DATEVALUE(\"1\"&N$6&\"2000\")))*(Transactions[Montant]))","v":0},{"$f":"SUM(Revenus_budget10[[#This Row],[Janvier]:[Décembre]])","v":673885}]
[null,"Revenus complémentaires",{"$f":"SUMPRODUCT((Transactions[Catégorie]=Revenus_budget10[[#This Row],[Revenus]])*(MONTH(Transactions[Date])=MONTH(DATEVALUE(\"1\"&C$6&\"2000\")))*(Transactions[Montant]))","v":0},{"$f":"SUMPRODUCT((Transactions[Catégorie]=Revenus_budget10[[#This Row],[Revenus]])*(MONTH(Transactions[Date])=MONTH(DATEVALUE(\"1\"&D$6&\"2000\")))*(Transactions[Montant]))","v":0},{"$f":"SUMPRODUCT((Transactions[Catégorie]=Revenus_budget10[[#This Row],[Revenus]])*(MONTH(Transactions[Date])=MONTH(DATEVALUE(\"1\"&E$6&\"2000\")))*(Transactions[Montant]))","v":0},{"$f":"SUMPRODUCT((Transactions[Catégorie]=Revenus_budget10[[#This Row],[Revenus]])*(MONTH(Transactions[Date])=MONTH(DATEVALUE(\"1\"&F$6&\"2000\")))*(Transactions[Montant]))","v":0},{"$f":"SUMPRODUCT((Transactions[Catégorie]=Revenus_budget10[[#This Row],[Revenus]])*(MONTH(Transactions[Date])=MONTH(DATEVALUE(\"1\"&G$6&\"2000\")))*(Transactions[Montant]))","v":0},{"$f":"SUMPRODUCT((Transactions[Catégorie]=Revenus_budget10[[#This Row],[Revenus]])*(MONTH(Transactions[Date])=MONTH(DATEVALUE(\"1\"&H$6&\"2000\")))*(Transactions[Montant]))","v":0},{"$f":"SUMPRODUCT((Transactions[Catégorie]=Revenus_budget10[[#This Row],[Revenus]])*(MONTH(Transactions[Date])=MONTH(DATEVALUE(\"1\"&I$6&\"2000\")))*(Transactions[Montant]))","v":0},{"$f":"SUMPRODUCT((Transactions[Catégorie]=Revenus_budget10[[#This Row],[Revenus]])*(MONTH(Transactions[Date])=MONTH(DATEVALUE(\"1\"&J$6&\"2000\")))*(Transactions[Montant]))","v":0},{"$f":"SUMPRODUCT((Transactions[Catégorie]=Revenus_budget10[[#This Row],[Revenus]])*(MONTH(Transactions[Date])=MONTH(DATEVALUE(\"1\"&K$6&\"2000\")))*(Transactions[Montant]))","v":0},{"$f":"SUMPRODUCT((Transactions[Catégorie]=Revenus_budget10[[#This Row],[Revenus]])*(MONTH(Transactions[Date])=MONTH(DATEVALUE(\"1\"&L$6&\"2000\")))*(Transactions[Montant]))","v":0},{"$f":"SUMPRODUCT((Transactions[Catégorie]=Revenus_budget10[[#This Row],[Revenus]])*(MONTH(Transactions[Date])=MONTH(DATEVALUE(\"1\"&M$6&\"2000\")))*(Transactions[Montant]))","v":0},{"$f":"SUMPRODUCT((Transactions[Catégorie]=Revenus_budget10[[#This Row],[Revenus]])*(MONTH(Transactions[Date])=MONTH(DATEVALUE(\"1\"&N$6&\"2000\")))*(Transactions[Montant]))","v":0},{"$f":"SUM(Revenus_budget10[[#This Row],[Janvier]:[Décembre]])","v":0}]
[null,"Autres revenus",{"$f":"SUMPRODUCT((Transactions[Catégorie]=Revenus_budget10[[#This Row],[Revenus]])*(MONTH(Transactions[Date])=MONTH(DATEVALUE(\"1\"&C$6&\"2000\")))*(Transactions[Montant]))","v":0},{"$f":"SUMPRODUCT((Transactions[Catégorie]=Revenus_budget10[[#This Row],[Revenus]])*(MONTH(Transactions[Date])=MONTH(DATEVALUE(\"1\"&D$6&\"2000\")))*(Transactions[Montant]))","v":0},{"$f":"SUMPRODUCT((Transactions[Catégorie]=Revenus_budget10[[#This Row],[Revenus]])*(MONTH(Transactions[Date])=MONTH(DATEVALUE(\"1\"&E$6&\"2000\")))*(Transactions[Montant]))","v":0},{"$f":"SUMPRODUCT((Transactions[Catégorie]=Revenus_budget10[[#This Row],[Revenus]])*(MONTH(Transactions[Date])=MONTH(DATEVALUE(\"1\"&F$6&\"2000\")))*(Transactions[Montant]))","v":0},{"$f":"SUMPRODUCT((Transactions[Catégorie]=Revenus_budget10[[#This Row],[Revenus]])*(MONTH(Transactions[Date])=MONTH(DATEVALUE(\"1\"&G$6&\"2000\")))*(Transactions[Montant]))","v":0},{"$f":"SUMPRODUCT((Transactions[Catégorie]=Revenus_budget10[[#This Row],[Revenus]])*(MONTH(Transactions[Date])=MONTH(DATEVALUE(\"1\"&H$6&\"2000\")))*(Transactions[Montant]))","v":0},{"$f":"SUMPRODUCT((Transactions[Catégorie]=Revenus_budget10[[#This Row],[Revenus]])*(MONTH(Transactions[Date])=MONTH(DATEVALUE(\"1\"&I$6&\"2000\")))*(Transactions[Montant]))","v":0},{"$f":"SUMPRODUCT((Transactions[Catégorie]=Revenus_budget10[[#This Row],[Revenus]])*(MONTH(Transactions[Date])=MONTH(DATEVALUE(\"1\"&J$6&\"2000\")))*(Transactions[Montant]))","v":3000},{"$f":"SUMPRODUCT((Transactions[Catégorie]=Revenus_budget10[[#This Row],[Revenus]])*(MONTH(Transactions[Date])=MONTH(DATEVALUE(\"1\"&K$6&\"2000\")))*(Transactions[Montant]))","v":0},{"$f":"SUMPRODUCT((Transactions[Catégorie]=Revenus_budget10[[#This Row],[Revenus]])*(MONTH(Transactions[Date])=MONTH(DATEVALUE(\"1\"&L$6&\"2000\")))*(Transactions[Montant]))","v":0},{"$f":"SUMPRODUCT((Transactions[Catégorie]=Revenus_budget10[[#This Row],[Revenus]])*(MONTH(Transactions[Date])=MONTH(DATEVALUE(\"1\"&M$6&\"2000\")))*(Transactions[Montant]))","v":0},{"$f":"SUMPRODUCT((Transactions[Catégorie]=Revenus_budget10[[#This Row],[Revenus]])*(MONTH(Transactions[Date])=MONTH(DATEVALUE(\"1\"&N$6&\"2000\")))*(Transactions[Montant]))","v":0},{"$f":"SUM(Revenus_budget10[[#This Row],[Janvier]:[Décembre]])","v":3000}]
[null,"Total",{"$f":"SUBTOTAL(109,C7:C9)","v":0},{"$f":"SUBTOTAL(109,D7:D9)","v":0},0,0,0,0,0,676885,0,0,0,0,{"$f":"SUM(Revenus_budget10[[#This Row],[Janvier]:[Décembre]])","v":676885}]
[]
[]
[]
[]
[null,"Charges","Janvier","Février","Mars","Avril","Mai","Juin","Juillet","Août","Septembre","Octobre","Novembre","Décembre","Total"]
[null,"Loyer",{"$f":"SUMPRODUCT((Transactions[Catégorie]=Dépenses_budget11[[#This Row],[Charges]])*(MONTH(Transactions[Date])=MONTH(DATEVALUE(\"1\"&C$6&\"2000\")))*(Transactions[Montant]))","v":0},{"$f":"SUMPRODUCT((Transactions[Catégorie]=Dépenses_budget11[[#This Row],[Charges]])*(MONTH(Transactions[Date])=MONTH(DATEVALUE(\"1\"&D$6&\"2000\")))*(Transactions[Montant]))","v":0},{"$f":"SUMPRODUCT((Transactions[Catégorie]=Dépenses_budget11[[#This Row],[Charges]])*(MONTH(Transactions[Date])=MONTH(DATEVALUE(\"1\"&E$6&\"2000\")))*(Transactions[Montant]))","v":0},{"$f":"SUMPRODUCT((Transactions[Catégorie]=Dépenses_budget11[[#This Row],[Charges]])*(MONTH(Transactions[Date])=MONTH(DATEVALUE(\"1\"&F$6&\"2000\")))*(Transactions[Montant]))","v":0},{"$f":"SUMPRODUCT((Transactions[Catégorie]=Dépenses_budget11[[#This Row],[Charges]])*(MONTH(Transactions[Date])=MONTH(DATEVALUE(\"1\"&G$6&\"2000\")))*(Transactions[Montant]))","v":0},{"$f":"SUMPRODUCT((Transactions[Catégorie]=Dépenses_budget11[[#This Row],[Charges]])*(MONTH(Transactions[Date])=MONTH(DATEVALUE(\"1\"&H$6&\"2000\")))*(Transactions[Montant]))","v":0},{"$f":"SUMPRODUCT((Transactions[Catégorie]=Dépenses_budget11[[#This Row],[Charges]])*(MONTH(Transactions[Date])=MONTH(DATEVALUE(\"1\"&I$6&\"2000\")))*(Transactions[Montant]))","v":0},{"$f":"SUMPRODUCT((Transactions[Catégorie]=Dépenses_budget11[[#This Row],[Charges]])*(MONTH(Transactions[Date])=MONTH(DATEVALUE(\"1\"&J$6&\"2000\")))*(Transactions[Montant]))","v":0},{"$f":"SUMPRODUCT((Transactions[Catégorie]=Dépenses_budget11[[#This Row],[Charges]])*(MONTH(Transactions[Date])=MONTH(DATEVALUE(\"1\"&K$6&\"2000\")))*(Transactions[Montant]))","v":0},{"$f":"SUMPRODUCT((Transactions[Catégorie]=Dépenses_budget11[[#This Row],[Charges]])*(MONTH(Transactions[Date])=MONTH(DATEVALUE(\"1\"&L$6&\"2000\")))*(Transactions[Montant]))","v":0},{"$f":"SUMPRODUCT((Transactions[Catégorie]=Dépenses_budget11[[#This Row],[Charges]])*(MONTH(Transactions[Date])=MONTH(DATEVALUE(\"1\"&M$6&\"2000\")))*(Transactions[Montant]))","v":0},{"$f":"SUMPRODUCT((Transactions[Catégorie]=Dépenses_budget11[[#This Row],[Charges]])*(MONTH(Transactions[Date])=MONTH(DATEVALUE(\"1\"&N$6&\"2000\")))*(Transactions[Montant]))","v":0},{"$f":"SUM(Dépenses_budget11[[#This Row],[Janvier]:[Décembre]])","v":0}]
[null,"CIE",{"$f":"SUMPRODUCT((Transactions[Catégorie]=Dépenses_budget11[[#This Row],[Charges]])*(MONTH(Transactions[Date])=MONTH(DATEVALUE(\"1\"&C$6&\"2000\")))*(Transactions[Montant]))","v":0},{"$f":"SUMPRODUCT((Transactions[Catégorie]=Dépenses_budget11[[#This Row],[Charges]])*(MONTH(Transactions[Date])=MONTH(DATEVALUE(\"1\"&D$6&\"2000\")))*(Transactions[Montant]))","v":0},{"$f":"SUMPRODUCT((Transactions[Catégorie]=Dépenses_budget11[[#This Row],[Charges]])*(MONTH(Transactions[Date])=MONTH(DATEVALUE(\"1\"&E$6&\"2000\")))*(Transactions[Montant]))","v":0},{"$f":"SUMPRODUCT((Transactions[Catégorie]=Dépenses_budget11[[#This Row],[Charges]])*(MONTH(Transactions[Date])=MONTH(DATEVALUE(\"1\"&F$6&\"2000\")))*(Transactions[Montant]))","v":0},{"$f":"SUMPRODUCT((Transactions[Catégorie]=Dépenses_budget11[[#This Row],[Charges]])*(MONTH(Transactions[Date])=MONTH(DATEVALUE(\"1\"&G$6&\"2000\")))*(Transactions[Montant]))","v":0},{"$f":"SUMPRODUCT((Transactions[Catégorie]=Dépenses_budget11[[#This Row],[Charges]])*(MONTH(Transactions[Date])=MONTH(DATEVALUE(\"1\"&H$6&\"2000\")))*(Transactions[Montant]))","v":0},{"$f":"SUMPRODUCT((Transactions[Catégorie]=Dépenses_budget11[[#This Row],[Charges]])*(MONTH(Transactions[Date])=MONTH(DATEVALUE(\"1\"&I$6&\"2000\")))*(Transactions[Montant]))","v":0},{"$f":"SUMPRODUCT((Transactions[Catégorie]=Dépenses_budget11[[#This Row],[Charges]])*(MONTH(Transactions[Date])=MONTH(DATEVALUE(\"1\"&J$6&\"2000\")))*(Transactions[Montant]))","v":5000},{"$f":"SUMPRODUCT((Transactions[Catégorie]=Dépenses_budget11[[#This Row],[Charges]])*(MONTH(Transactions[Date])=MONTH(DATEVALUE(\"1\"&K$6&\"2000\")))*(Transactions[Montant]))","v":0},{"$f":"SUMPRODUCT((Transactions[Catégorie]=Dépenses_budget11[[#This Row],[Charges]])*(MONTH(Transactions[Date])=MONTH(DATEVALUE(\"1\"&L$6&\"2000\")))*(Transactions[Montant]))","v":0},{"$f":"SUMPRODUCT((Transactions[Catégorie]=Dépenses_budget11[[#This Row],[Charges]])*(MONTH(Transactions[Date])=MONTH(DATEVALUE(\"1\"&M$6&\"2000\")))*(Transactions[Montant]))","v":0},{"$f":"SUMPRODUCT((Transactions[Catégorie]=Dépenses_budget11[[#This Row],[Charges]])*(MONTH(Transactions[Date])=MONTH(DATEVALUE(\"1\"&N$6&\"2000\")))*(Transactions[Montant]))","v":0},{"$f":"SUM(Dépenses_budget11[[#This Row],[Janvier]:[Décembre]])","v":5000}]
[null,"SODECI",{"$f":"SUMPRODUCT((Transactions[Catégorie]=Dépenses_budget11[[#This Row],[Charges]])*(MONTH(Transactions[Date])=MONTH(DATEVALUE(\"1\"&C$6&\"2000\")))*(Transactions[Montant]))","v":0},{"$f":"SUMPRODUCT((Transactions[Catégorie]=Dépenses_budget11[[#This Row],[Charges]])*(MONTH(Transactions[Date])=MONTH(DATEVALUE(\"1\"&D$6&\"2000\")))*(Transactions[Montant]))","v":0},{"$f":"SUMPRODUCT((Transactions[Catégorie]=Dépenses_budget11[[#This Row],[Charges]])*(MONTH(Transactions[Date])=MONTH(DATEVALUE(\"1\"&E$6&\"2000\")))*(Transactions[Montant]))","v":0},{"$f":"SUMPRODUCT((Transactions[Catégorie]=Dépenses_budget11[[#This Row],[Charges]])*(MONTH(Transactions[Date])=MONTH(DATEVALUE(\"1\"&F$6&\"2000\")))*(Transactions[Montant]))","v":0},{"$f":"SUMPRODUCT((Transactions[Catégorie]=Dépenses_budget11[[#This Row],[Charges]])*(MONTH(Transactions[Date])=MONTH(DATEVALUE(\"1\"&G$6&\"2000\")))*(Transactions[Montant]))","v":0},{"$f":"SUMPRODUCT((Transactions[Catégorie]=Dépenses_budget11[[#This Row],[Charges]])*(MONTH(Transactions[Date])=MONTH(DATEVALUE(\"1\"&H$6&\"2000\")))*(Transactions[Montant]))","v":0},{"$f":"SUMPRODUCT((Transactions[Catégorie]=Dépenses_budget11[[#This Row],[Charges]])*(MONTH(Transactions[Date])=MONTH(DATEVALUE(\"1\"&I$6&\"2000\")))*(Transactions[Montant]))","v":0},{"$f":"SUMPRODUCT((Transactions[Catégorie]=Dépenses_budget11[[#This Row],[Charges]])*(MONTH(Transactions[Date])=MONTH(DATEVALUE(\"1\"&J$6&\"2000\")))*(Transactions[Montant]))","v":0},{"$f":"SUMPRODUCT((Transactions[Catégorie]=Dépenses_budget11[[#This Row],[Charges]])*(MONTH(Transactions[Date])=MONTH(DATEVALUE(\"1\"&K$6&\"2000\")))*(Transactions[Montant]))","v":0},{"$f":"SUMPRODUCT((Transactions[Catégorie]=Dépenses_budget11[[#This Row],[Charges]])*(MONTH(Transactions[Date])=MONTH(DATEVALUE(\"1\"&L$6&\"2000\")))*(Transactions[Montant]))","v":0},{"$f":"SUMPRODUCT((Transactions[Catégorie]=Dépenses_budget11[[#This Row],[Charges]])*(MONTH(Transactions[Date])=MONTH(DATEVALUE(\"1\"&M$6&\"2000\")))*(Transactions[Montant]))","v":0},{"$f":"SUMPRODUCT((Transactions[Catégorie]=Dépenses_budget11[[#This Row],[Charges]])*(MONTH(Transactions[Date])=MONTH(DATEVALUE(\"1\"&N$6&\"2000\")))*(Transactions[Montant]))","v":0},{"$f":"SUM(Dépenses_budget11[[#This Row],[Janvier]:[Décembre]])","v":0}]
[null,"Gaz",{"$f":"SUMPRODUCT((Transactions[Catégorie]=Dépenses_budget11[[#This Row],[Charges]])*(MONTH(Transactions[Date])=MONTH(DATEVALUE(\"1\"&C$6&\"2000\")))*(Transactions[Montant]))","v":0},{"$f":"SUMPRODUCT((Transactions[Catégorie]=Dépenses_budget11[[#This Row],[Charges]])*(MONTH(Transactions[Date])=MONTH(DATEVALUE(\"1\"&D$6&\"2000\")))*(Transactions[Montant]))","v":0},{"$f":"SUMPRODUCT((Transactions[Catégorie]=Dépenses_budget11[[#This Row],[Charges]])*(MONTH(Transactions[Date])=MONTH(DATEVALUE(\"1\"&E$6&\"2000\")))*(Transactions[Montant]))","v":0},{"$f":"SUMPRODUCT((Transactions[Catégorie]=Dépenses_budget11[[#This Row],[Charges]])*(MONTH(Transactions[Date])=MONTH(DATEVALUE(\"1\"&F$6&\"2000\")))*(Transactions[Montant]))","v":0},{"$f":"SUMPRODUCT((Transactions[Catégorie]=Dépenses_budget11[[#This Row],[Charges]])*(MONTH(Transactions[Date])=MONTH(DATEVALUE(\"1\"&G$6&\"2000\")))*(Transactions[Montant]))","v":0},{"$f":"SUMPRODUCT((Transactions[Catégorie]=Dépenses_budget11[[#This Row],[Charges]])*(MONTH(Transactions[Date])=MONTH(DATEVALUE(\"1\"&H$6&\"2000\")))*(Transactions[Montant]))","v":0},{"$f":"SUMPRODUCT((Transactions[Catégorie]=Dépenses_budget11[[#This Row],[Charges]])*(MONTH(Transactions[Date])=MONTH(DATEVALUE(\"1\"&I$6&\"2000\")))*(Transactions[Montant]))","v":0},{"$f":"SUMPRODUCT((Transactions[Catégorie]=Dépenses_budget11[[#This Row],[Charges]])*(MONTH(Transactions[Date])=MONTH(DATEVALUE(\"1\"&J$6&\"2000\")))*(Transactions[Montant]))","v":0},{"$f":"SUMPRODUCT((Transactions[Catégorie]=Dépenses_budget11[[#This Row],[Charges]])*(MONTH(Transactions[Date])=MONTH(DATEVALUE(\"1\"&K$6&\"2000\")))*(Transactions[Montant]))","v":0},{"$f":"SUMPRODUCT((Transactions[Catégorie]=Dépenses_budget11[[#This Row],[Charges]])*(MONTH(Transactions[Date])=MONTH(DATEVALUE(\"1\"&L$6&\"2000\")))*(Transactions[Montant]))","v":0},{"$f":"SUMPRODUCT((Transactions[Catégorie]=Dépenses_budget11[[#This Row],[Charges]])*(MONTH(Transactions[Date])=MONTH(DATEVALUE(\"1\"&M$6&\"2000\")))*(Transactions[Montant]))","v":0},{"$f":"SUMPRODUCT((Transactions[Catégorie]=Dépenses_budget11[[#This Row],[Charges]])*(MONTH(Transactions[Date])=MONTH(DATEVALUE(\"1\"&N$6&\"2000\")))*(Transactions[Montant]))","v":0},{"$f":"SUM(Dépenses_budget11[[#This Row],[Janvier]:[Décembre]])","v":0}]
[null,"Nourriture",{"$f":"SUMPRODUCT((Transactions[Catégorie]=Dépenses_budget11[[#This Row],[Charges]])*(MONTH(Transactions[Date])=MONTH(DATEVALUE(\"1\"&C$6&\"2000\")))*(Transactions[Montant]))","v":0},{"$f":"SUMPRODUCT((Transactions[Catégorie]=Dépenses_budget11[[#This Row],[Charges]])*(MONTH(Transactions[Date])=MONTH(DATEVALUE(\"1\"&D$6&\"2000\")))*(Transactions[Montant]))","v":0},{"$f":"SUMPRODUCT((Transactions[Catégorie]=Dépenses_budget11[[#This Row],[Charges]])*(MONTH(Transactions[Date])=MONTH(DATEVALUE(\"1\"&E$6&\"2000\")))*(Transactions[Montant]))","v":0},{"$f":"SUMPRODUCT((Transactions[Catégorie]=Dépenses_budget11[[#This Row],[Charges]])*(MONTH(Transactions[Date])=MONTH(DATEVALUE(\"1\"&F$6&\"2000\")))*(Transactions[Montant]))","v":0},{"$f":"SUMPRODUCT((Transactions[Catégorie]=Dépenses_budget11[[#This Row],[Charges]])*(MONTH(Transactions[Date])=MONTH(DATEVALUE(\"1\"&G$6&\"2000\")))*(Transactions[Montant]))","v":0},{"$f":"SUMPRODUCT((Transactions[Catégorie]=Dépenses_budget11[[#This Row],[Charges]])*(MONTH(Transactions[Date])=MONTH(DATEVALUE(\"1\"&H$6&\"2000\")))*(Transactions[Montant]))","v":0},{"$f":"SUMPRODUCT((Transactions[Catégorie]=Dépenses_budget11[[#This Row],[Charges]])*(MONTH(Transactions[Date])=MONTH(DATEVALUE(\"1\"&I$6&\"2000\")))*(Transactions[Montant]))","v":0},{"$f":"SUMPRODUCT((Transactions[Catégorie]=Dépenses_budget11[[#This Row],[Charges]])*(MONTH(Transactions[Date])=MONTH(DATEVALUE(\"1\"&J$6&\"2000\")))*(Transactions[Montant]))","v":21000},{"$f":"SUMPRODUCT((Transactions[Catégorie]=Dépenses_budget11[[#This Row],[Charges]])*(MONTH(Transactions[Date])=MONTH(DATEVALUE(\"1\"&K$6&\"2000\")))*(Transactions[Montant]))","v":0},{"$f":"SUMPRODUCT((Transactions[Catégorie]=Dépenses_budget11[[#This Row],[Charges]])*(MONTH(Transactions[Date])=MONTH(DATEVALUE(\"1\"&L$6&\"2000\")))*(Transactions[Montant]))","v":0},{"$f":"SUMPRODUCT((Transactions[Catégorie]=Dépenses_budget11[[#This Row],[Charges]])*(MONTH(Transactions[Date])=MONTH(DATEVALUE(\"1\"&M$6&\"2000\")))*(Transactions[Montant]))","v":0},{"$f":"SUMPRODUCT((Transactions[Catégorie]=Dépenses_budget11[[#This Row],[Charges]])*(MONTH(Transactions[Date])=MONTH(DATEVALUE(\"1\"&N$6&\"2000\")))*(Transactions[Montant]))","v":0},{"$f":"SUM(Dépenses_budget11[[#This Row],[Janvier]:[Décembre]])","v":21000}]
{"$rows_left_out":46}
{"sheet":"Transactions","index":4,"n_rows":33,"n_cols":7,"rows_kept":33,"cut":false,"hidden":false,"merged":[[8,2,8,5]]}
[]
[]
[]
[]
[]
[null,"Date",{"$f":"TODAY()","v":"2025-08-07"},null,"Type"]
[null,"Catégorie",null,null,"Montant"]
[null,"Finances"]
[null,"Commentaire"]
[]
[null,"Liste des transactions"]
[]
[null,"Date","Type","Catégorie","Finances","Montant","Commentaire"]
[null,"2025-08-06","Charges","Transport","Espèce",1500,"Transport retour pour la maison"]
[null,"2025-08-06","Charges","CIE","Wave",5000,"Facture CIE du mois de juillet"]
[null,"2025-08-05","Epargnes","Autres epargnes","Banque",50000,"Epargne"]
[null,"2025-08-05","Crédits","emprunt bancaire","Banque",10000,"Garantie prêt"]
[null,"2025-08-05","Revenus","Salaire","Banque",650000,"Paie du mois de juin"]
[null,"2025-08-05","Charges","Transport","Espèce",1000,"Transport du matin pour le travail"]
[null,"2025-08-04","Revenus","Autres revenus","Wave",3000,"Remboursement de crédit (Léti)"]
{"$rows_left_out":14}
{"sheet":"Transfert","index":5,"n_rows":14,"n_cols":6,"rows_kept":14,"cut":false,"hidden":false,"merged":[[8,2,8,5]]}
[]
[]
[]
[]
[]
[null,"Date",{"$f":"TODAY()","v":"2025-08-07"}]
[null,"Sources",null,null,"Montant",300000]
[null,"Destinations"]
[null,"Commentaire"]
[]
[null,"Liste des transactions"]
[]
[null,"Date","Sources","Destinations","Montant","Commentaire"]
[null,"2025-08-03","Banque","Espèce",105000,"Retrait au guichet le 01/08/2025"]

{"sheet":"Contrôle","index":6,"n_rows":12,"n_cols":5,"rows_kept":12,"cut":false,"hidden":false,"merged":[]}
[]
[]
[]
[]
["Contrôle"]
[null,"Comptes","Théorique","Final","Ecarts"]
[null,"Espèce",{"$f":"_xlfn.XLOOKUP(B7,Traitement!$B$60:$B$63,Traitement!$N$60:$N$63,0,0)","v":{"$error":"#NAME?"}},50850,{"$f":"C7-D7","v":{"$error":"#NAME?"}}]
[null,"Banque",{"$f":"_xlfn.XLOOKUP(B8,Traitement!$B$60:$B$63,Traitement!$N$60:$N$63,0,0)","v":{"$error":"#NAME?"}},200928,{"$f":"C8-D8","v":{"$error":"#NAME?"}}]
[null,"Wave",{"$f":"_xlfn.XLOOKUP(B9,Traitement!$B$60:$B$63,Traitement!$N$60:$N$63,0,0)","v":{"$error":"#NAME?"}},3535,{"$error":"#NAME?"}]
[null,"Djamo",{"$f":"_xlfn.XLOOKUP(B10,Traitement!$B$60:$B$63,Traitement!$N$60:$N$63,0,0)","v":{"$error":"#NAME?"}},null,{"$error":"#NAME?"}]
[null,"Autres comptes",{"$f":"SUM(C9:C10)","v":{"$error":"#NAME?"}},null,{"$error":"#NAME?"}]
[null,"Total",{"$f":"C11+C8+C7","v":{"$error":"#NAME?"}},{"$f":"D11+D8+D7","v":251778},{"$f":"E11+E8+E7","v":{"$error":"#NAME?"}}]

{"sheet":"Traitement","index":7,"n_rows":68,"n_cols":14,"rows_kept":68,"cut":false,"hidden":false,"merged":[[48,0,48,1],[53,0,53,1],[58,0,58,1],[63,0,63,1]]}
[null,"Réel","Budget","Ratios","Total"]
["Revenus",{"$f":"Dashboard!C42","v":676885},{"$f":"Dashboard!D42","v":680000},{"$f":"IFERROR(B2/C2,0)","v":0.99541911764705882},1]
["Charges fixes",{"$f":"Dashboard!G42+Dashboard!O42","v":159072},{"$f":"Dashboard!H42+Dashboard!P42","v":304000},0.52326315789473687,1]
["Charges variables",{"$f":"Dashboard!K42","v":51000},{"$f":"Dashboard!L42","v":171000},0.2982456140350877,1]
["Investissements",{"$f":"Dashboard!K43","v":0},{"$f":"Dashboard!L43","v":0},0,1]
["Epargnes",{"$f":"Dashboard!W42","v":50000},{"$f":"Dashboard!X42","v":127000},0.39370078740157483,1]
["Solde Net",{"$f":"B2-SUM(B3:B6)","v":416813},{"$f":"C2-SUM(C3:C6)","v":78000}]
[]
[]
[]
[]
["Vue d'ensemble",null,"Réel"]
["Revenus",null,{"$f":"Dashboard!C42","v":676885}]
["Charges",null,{"$f":"Dashboard!G42","v":67000}]
["Autres charges & Loisirs",null,{"$f":"Dashboard!K42","v":51000}]
["Crédits",null,{"$f":"Dashboard!O42","v":92072}]
["Investissements",null,{"$f":"Dashboard!S42","v":0}]
["Epargnes",null,{"$f":"Dashboard!W42","v":50000}]
[]
[]
{"$rows_left_out":48}